{"text_format":"1","workbook":"xlsx","n_sheets":3,"sheets":["Decomposition_Prevalence","decomposition_by_disease","prevalence_of_disease"],"not_rendered":{"charts":2,"images":0,"macros":1,"external_links":0,"defined_names":0,"comments":0,"pivot_tables":0},"unopened":[],"bounds":{"document_bytes":16777216,"sheet_cells":100000,"rows_first":2000,"rows_last":500,"rows_between":2000,"halvings":0,"cell_chars":16384,"cell_head_chars":4096},"cells_cut":0,"cells_raw":0,"read":"whole","date_system":"1900"}

{"sheet":"Decomposition_Prevalence","index":0,"n_rows":45,"n_cols":24,"rows_kept":45,"cut":false,"hidden":false,"merged":[]}
[5,7]
[]
[]
[]
[]
[null,"Nominal Expenditure Growth: Nonimal Expenditures 2018/ Nominal Expenditures 2008","Price Index Growth: Yearly Cumulative Price Index 2018 /Yearly Cumulative Price Index 2008","Real Growth in 2008 dollars: Nominal Expenditure Growth / Price Index Growth","Population Growth Rate: US Population 2018 / US Population 2008","Prevalence Growth:  % of Population with Disease 2018/ % of Population with Disease in 2008","Growth Rate in Population Treated for Disease: People with Disease in 2018/ People with Disease 2008","Real Output per Treated Growth: Real Dollars per Treated 2018 / Real Dollars per Treated 2008"]
[{"$f":"INDEX(decomposition_by_disease!A2:A18,Decomposition_Prevalence!$A$1)","v":"5 Diseases of the nervous system and sense organs"},{"$f":"INDEX(decomposition_by_disease!B2:B18,Decomposition_Prevalence!$A$1)","v":1.9830301281},{"$f":"INDEX(decomposition_by_disease!C2:C18,Decomposition_Prevalence!$A$1)","v":1.0704786396999999},{"$f":"INDEX(decomposition_by_disease!D2:D18,Decomposition_Prevalence!$A$1)","v":1.8524705254},{"$f":"INDEX(decomposition_by_disease!E2:E18,Decomposition_Prevalence!$A$1)","v":1.0747934374000001},{"$f":"INDEX(decomposition_by_disease!F2:F18,Decomposition_Prevalence!$A$1)","v":0.92422273369999997},{"$f":"INDEX(decomposition_by_disease!G2:G18,Decomposition_Prevalence!$A$1)","v":0.99334852880000002},{"$f":"INDEX(decomposition_by_disease!H2:H18,Decomposition_Prevalence!$A$1)","v":1.8648746856}]
[{"$f":"INDEX(decomposition_by_disease!A2:A18,Decomposition_Prevalence!$B$1)","v":"7 Diseases of the respiratory system"},{"$f":"INDEX(decomposition_by_disease!B2:B20,Decomposition_Prevalence!$B$1)","v":1.5294891755},{"$f":"INDEX(decomposition_by_disease!C2:C20,Decomposition_Prevalence!$B$1)","v":1.2823290205},{"$f":"INDEX(decomposition_by_disease!D2:D20,Decomposition_Prevalence!$B$1)","v":1.1927431658000001},{"$f":"INDEX(decomposition_by_disease!E2:E20,Decomposition_Prevalence!$B$1)","v":1.0747934374000001},{"$f":"INDEX(decomposition_by_disease!F2:F20,Decomposition_Prevalence!$B$1)","v":0.51398813639999996},{"$f":"INDEX(decomposition_by_disease!G2:G20,Decomposition_Prevalence!$B$1)","v":0.55243107579999995},{"$f":"INDEX(decomposition_by_disease!H2:H20,Decomposition_Prevalence!$B$1)","v":2.1590805042999999}]
[]
[]
[]
[]
[]
[]
[]
[]
[]
[]
[]
[]
[]
[]
[]
[]
[]
[]
[]
[]
[]
[]
[]
[]
[]
[]
[]
[]
[]
[]
[1,2]
[]
{"$rows_left_out":6}
{"sheet":"decomposition_by_disease","index":1,"n_rows":18,"n_cols":8,"rows_kept":18,"cut":false,"hidden":false,"merged":[]}
["Diseases","Nominal Expenditure Growth: Nonimal Expenditures 2018/ Nominal Expenditures 2008","Price Index Growth: Yearly Cumulative Price Index 2018 / Yearly Cumulative Price Index 2008","Real Growth in 2008 dollars: Nominal Expenditure Growth / Price Index Growth","Population Growth Rate: US Population 2018 / US Population 2008","Prevalence Growth:  % of Population with Disease 2018/ % of Population with Disease in 2008","Growth Rate for Number of People Treated for Disease:People with Disease in 2018/ People with Disease 2008","Real Output per Treated Growth: Real Dollars per Treated 2018 / Real Dollars per Treated 2008"]
["1 Infectious and parasitic diseases",2.4126381665999999,1.0220043560000001,2.3606926452999999,1.0747934374000001,0.74899574540000002,0.80501571179999998,2.9324802121000002]
["2 Neoplasms",1.0094441664,0.82517742920000003,1.2233055955000001,1.0747934374000001,0.74573915359999998,0.80151554830000005,1.5262406301]
["3 Endocrine, nutritional, and metabolic diseases and immunity disorders",1.7961619606000001,1.1330523960000001,1.5852417478,1.0747934374000001,0.99077785839999999,1.0648815401,1.4886554872]
["4 Mental disorders",1.8714722813,1.1727856502,1.5957496418999999,1.0747934374000001,1.0681157751999999,1.1480038255,1.3900211885]
["5 Diseases of the nervous system and sense organs",1.9830301281,1.0704786396999999,1.8524705254,1.0747934374000001,0.92422273369999997,0.99334852880000002,1.8648746856]
["6 Diseases of the circulatory system",1.2264771875,0.93179624910000003,1.3162504021000001,1.0747934374000001,0.90287172869999999,0.97040060880000001,1.3563989863000001]
["7 Diseases of the respiratory system",1.5294891755,1.2823290205,1.1927431658000001,1.0747934374000001,0.51398813639999996,0.55243107579999995,2.1590805042999999]
["8 Diseases of the digestive system",1.1200515704,1.1907584008000001,0.94062033879999996,1.0747934374000001,0.44601390829999998,0.4793728216,1.9621895451]
["9 Diseases of the genitourinary system",1.6166583847,0.99817869709999996,1.6196081819000001,1.0747934374000001,0.9214600396,0.99037920339999996,1.6353414694999999]
["10 Complications of pregnancy, childbirth, and the puerperium",1.4730105524999999,0.98833898389999997,1.4903900145,1.0747934374000001,0.76288178770000004,0.81994033889999995,1.8176810479000001]
["11 Diseases of the skin and subcutaneous tissue",1.4970966995999999,1.2615803538000001,1.1866835871000001,1.0747934374000001,0.89172439160000005,0.95841952399999997,1.2381671673000001]
["12 Diseases of the musculoskeletal system and connective tissue",1.9441183211999999,1.1013801996000001,1.7651654912999999,1.0747934374000001,0.83333564699999996,0.8956636845,1.970790512]
["13 Injury and poisoning",0.99398043830000005,1.1468431217999999,0.86671003160000004,1.0747934374000001,0.52382621230000004,0.56300497530000004,1.5394358301]
["14 Symptoms; signs; and ill-defined conditions",4.1531578451,1.2226211618,3.3969294616000001,1.0747934374000001,1.5162481000000001,1.6296535073,2.0844489006]
["15 Blood and blood-forming organs; congenital anomalies; and certain conditions originating in the perinatal period",0.39462559149999998,0.7947630617,0.49653237610000001,1.0747934374000001,0.43661801579999998,0.46927417809999999,1.0580858682000001]
["16 Residual codes; unclassified",4.0000920039999999,0.92300276079999999,4.3337811911999999,1.0747934374000001,1.744138527,1.8745886426,2.3118571683]
["17 Dental Diseases",1.5327856109,1.2883177670999999,1.1897574108,1.0747934374000001,1.0813917573,1.1622727638999999,1.0236473293999999]

{"sheet":"prevalence_of_disease","index":2,"n_rows":43,"n_cols":24,"rows_kept":43,"cut":false,"hidden":false,"merged":[]}
["Period ","1 Infectious and parasitic diseases ","2 Neoplasms ","3 Endocrine- nutritional- and metabolic diseases and immunity disorders ","4 Mental disorders ","5 Diseases of the nervous system and sense organs ","6 Diseases of the circulatory system ","7 Diseases of the respiratory system ","8 Diseases of the digestive system ","9 Diseases of the genitourinary system ","10 Complications of pregnancy- childbirth- and the puerperium ","11 Diseases of the skin and subcutaneous tissue ","12 Diseases of the musculoskeletal system and connective tissue ","13 Injury and poisoning ","14 Symptoms; signs; and ill-defined conditions ","15 Blood and blood-forming organs; congenital anomalies; and certain conditions originating in the perinatal period ","16 Residual codes; unclassified ","17 Dental Diseases"]
[1996,0.13181799999999999,6.2214999999999999E-2,0.15681400000000001,0.133571,0.366956,0.22200800000000001,0.796906,0.433479,0.15632699999999999,5.3117999999999999E-2,0.117546,0.26456299999999999,0.24623400000000001,0.21856400000000001,2.3099999999999999E-2,0.184756,0.428477]
[1997,0.10299800000000001,6.3889000000000001E-2,0.168571,0.14489299999999999,0.33805400000000002,0.24273,0.69800899999999999,0.331376,0.14779300000000001,5.1402000000000003E-2,0.102951,0.27713900000000002,0.26100200000000001,0.18465400000000001,2.1385999999999999E-2,0.17597699999999999,0.41583500000000001]
[1998,9.1104000000000004E-2,6.2502000000000002E-2,0.17077200000000001,0.147672,0.30982799999999999,0.23807800000000001,0.63658800000000004,0.28692400000000001,0.12568399999999999,4.9655999999999999E-2,9.9276000000000003E-2,0.27509400000000001,0.233069,0.16591700000000001,2.1121000000000001E-2,0.16206200000000001,0.42045900000000003]
[1999,8.5203000000000001E-2,6.0588000000000003E-2,0.179788,0.13693900000000001,0.28362900000000002,0.23342099999999999,0.61895999999999995,0.29419600000000001,0.126664,5.2322E-2,9.2638999999999999E-2,0.271727,0.21521399999999999,0.171484,1.9557999999999999E-2,0.16225100000000001,0.42646899999999999]
[2000,8.6850999999999998E-2,6.0946E-2,0.19489200000000001,0.140907,0.27263900000000002,0.24367900000000001,0.59842700000000004,0.293265,0.13462099999999999,5.9855999999999999E-2,9.9927000000000002E-2,0.27080599999999999,0.21557100000000001,0.177706,2.2263000000000002E-2,0.15409900000000001,0.41047]
[2001,9.1778999999999999E-2,6.6405000000000006E-2,0.21321999999999999,0.16026399999999999,0.286715,0.25401600000000002,0.64293,0.29280800000000001,0.14333599999999999,6.4588999999999994E-2,0.11021400000000001,0.302757,0.227079,0.194192,2.3708E-2,0.17194899999999999,0.42507499999999998]
[2002,9.0699000000000002E-2,7.2136000000000006E-2,0.224971,0.18947,0.28705900000000001,0.27818399999999999,0.62278599999999995,0.31430999999999998,0.143425,6.2475000000000003E-2,0.109875,0.33568700000000001,0.22998399999999999,0.21023500000000001,2.3948000000000001E-2,0.16422500000000001,0.43576199999999998]
[2003,8.9542999999999998E-2,7.1162000000000003E-2,0.23344799999999999,0.193111,0.29835200000000001,0.28833199999999998,0.63576699999999997,0.32328000000000001,0.144256,6.5583000000000002E-2,0.10634200000000001,0.34329700000000002,0.23430500000000001,0.21048600000000001,2.4395E-2,0.162634,0.44119900000000001]
[2004,8.1751000000000004E-2,6.8476999999999996E-2,0.25810300000000003,0.203953,0.30129499999999998,0.298983,0.60596399999999995,0.31501400000000002,0.14102700000000001,6.4342999999999997E-2,9.9779999999999994E-2,0.35052899999999998,0.23383699999999999,0.206622,2.3774E-2,0.16048699999999999,0.43736000000000003]
[2005,8.3677000000000001E-2,6.8398E-2,0.27084900000000001,0.21121799999999999,0.28454000000000002,0.30205599999999999,0.64726300000000003,0.30668600000000001,0.140318,5.9288E-2,9.8683999999999994E-2,0.34431600000000001,0.230048,0.19259200000000001,2.2463E-2,0.15365799999999999,0.43406499999999998]
[2006,8.0027000000000001E-2,7.0943999999999993E-2,0.27899299999999999,0.21371200000000001,0.28784300000000002,0.29640100000000003,0.59185100000000002,0.31701499999999999,0.13297999999999999,5.6707E-2,9.6544000000000005E-2,0.34327800000000003,0.21479000000000001,0.176313,2.3854E-2,0.15454100000000001,0.43240099999999998]
[2007,7.9347000000000001E-2,7.8878000000000004E-2,0.31148700000000001,0.20644699999999999,0.27667900000000001,0.33677600000000002,0.51703399999999999,0.29971100000000001,0.12892999999999999,5.2221999999999998E-2,9.3912999999999996E-2,0.37210599999999999,0.21507000000000001,0.15704499999999999,2.3734000000000002E-2,0.150726,0.435977]
[2008,8.0598000000000003E-2,8.6208000000000007E-2,0.35617100000000002,0.210145,0.29011100000000001,0.38506400000000002,0.59288700000000005,0.35769299999999998,0.131327,5.1039000000000001E-2,9.5326999999999995E-2,0.40967300000000001,0.19825699999999999,0.15699199999999999,2.6551000000000002E-2,0.153589,0.42266300000000001]
[2009,8.6439000000000002E-2,8.2641000000000006E-2,0.356327,0.21879100000000001,0.29056799999999999,0.38561299999999998,0.60888200000000003,0.34709400000000001,0.13369200000000001,5.0488999999999999E-2,9.7175999999999998E-2,0.42200399999999999,0.20541899999999999,0.170428,2.8098000000000001E-2,0.169126,0.421821]
[2010,8.4969000000000003E-2,8.2086000000000006E-2,0.369174,0.22357399999999999,0.28298699999999999,0.39137499999999997,0.58528400000000003,0.32448700000000003,0.13269500000000001,5.2248999999999997E-2,9.6482999999999999E-2,0.43397799999999997,0.20141600000000001,0.17322699999999999,2.7810000000000001E-2,0.17200699999999999,0.41165200000000002]
[2011,8.4260000000000002E-2,8.9448E-2,0.382407,0.23500699999999999,0.30236000000000002,0.39298,0.57671300000000003,0.32605299999999998,0.132102,5.6105000000000002E-2,9.6906999999999993E-2,0.43801800000000002,0.19897999999999999,0.183756,3.0866000000000001E-2,0.17979400000000001,0.41047699999999998]
[2012,8.9540999999999996E-2,8.7640999999999997E-2,0.38377899999999998,0.25308700000000001,0.30186299999999999,0.39243899999999998,0.63829800000000003,0.27885100000000002,0.131269,5.9202999999999999E-2,0.105268,0.460476,0.20666499999999999,0.20031599999999999,3.2044000000000003E-2,0.17375099999999999,0.41389900000000002]
[2013,9.3483999999999998E-2,8.5773000000000002E-2,0.40035700000000002,0.26753900000000003,0.316081,0.401175,0.64857799999999999,0.29569099999999998,0.14558399999999999,6.0803000000000003E-2,0.11365500000000001,0.50914700000000002,0.24011199999999999,0.21691199999999999,3.2765000000000002E-2,0.19461500000000001,0.42365900000000001]
[2014,9.7493999999999997E-2,9.1367000000000004E-2,0.40654400000000002,0.28459800000000002,0.33441599999999999,0.40675499999999998,0.56282699999999997,0.26917400000000002,0.148641,5.3252000000000001E-2,0.116326,0.53506399999999998,0.240924,0.20849999999999999,3.2828000000000003E-2,0.18882299999999999,0.42644500000000002]
[2015,9.2215000000000005E-2,9.1082999999999997E-2,0.41867599999999999,0.29735800000000001,0.34538600000000003,0.41891099999999998,0.57347099999999995,0.27909600000000001,0.148227,5.3700999999999999E-2,0.113591,0.54431600000000002,0.24567,0.21937699999999999,3.3988999999999998E-2,0.19194,0.42974400000000001]
[2016,6.7850999999999995E-2,8.1162999999999999E-2,0.40721499999999999,0.28240399999999999,0.38672899999999999,0.39801700000000001,0.51012500000000005,0.24732799999999999,0.12879099999999999,4.7247999999999998E-2,0.105491,0.52571699999999999,0.19262399999999999,0.31342399999999998,1.6107E-2,0.339505,0.42682900000000001]
[2017,6.4070000000000002E-2,7.3650999999999994E-2,0.38217000000000001,0.274696,0.36211599999999999,0.37191299999999999,0.47613499999999997,0.22103500000000001,0.133518,4.3184E-2,9.6070000000000003E-2,0.493589,0.173176,0.29589500000000002,1.4803E-2,0.282696,0.43310399999999999]
[2018,6.0366999999999997E-2,6.4287999999999998E-2,0.35288700000000001,0.22445899999999999,0.268127,0.34766399999999997,0.30473699999999998,0.15953600000000001,0.12101199999999999,3.8935999999999998E-2,8.5005999999999998E-2,0.341395,0.103852,0.23804,1.1592E-2,0.26788000000000001,0.457065]
[]
[null,1996,1997,1998,1999,2000,2001,2002,2003,2004,2005,2006,2007,2008,2009,2010,2011,2012,2013,2014,2015,2016,2017,2018]
["1 Infectious and parasitic diseases",0.13181799999999999,0.10299800000000001,9.1104000000000004E-2,8.5203000000000001E-2,8.6850999999999998E-2,9.1778999999999999E-2,9.0699000000000002E-2,8.9542999999999998E-2,8.1751000000000004E-2,8.3677000000000001E-2,8.0027000000000001E-2,7.9347000000000001E-2,8.0598000000000003E-2,8.6439000000000002E-2,8.4969000000000003E-2,8.4260000000000002E-2,8.9540999999999996E-2,9.3483999999999998E-2,9.7493999999999997E-2,9.2215000000000005E-2,6.7850999999999995E-2,6.4070000000000002E-2,6.0366999999999997E-2]
["2 Neoplasms",6.2214999999999999E-2,6.3889000000000001E-2,6.2502000000000002E-2,6.0588000000000003E-2,6.0946E-2,6.6405000000000006E-2,7.2136000000000006E-2,7.1162000000000003E-2,6.8476999999999996E-2,6.8398E-2,7.0943999999999993E-2,7.8878000000000004E-2,8.6208000000000007E-2,8.2641000000000006E-2,8.2086000000000006E-2,8.9448E-2,8.7640999999999997E-2,8.5773000000000002E-2,9.1367000000000004E-2,9.1082999999999997E-2,8.1162999999999999E-2,7.3650999999999994E-2,6.4287999999999998E-2]
["3 Endocrine, nutritional, and metabolic diseases and immunity disorders",0.15681400000000001,0.168571,0.17077200000000001,0.179788,0.19489200000000001,0.21321999999999999,0.224971,0.23344799999999999,0.25810300000000003,0.27084900000000001,0.27899299999999999,0.31148700000000001,0.35617100000000002,0.356327,0.369174,0.382407,0.38377899999999998,0.40035700000000002,0.40654400000000002,0.41867599999999999,0.40721499999999999,0.38217000000000001,0.35288700000000001]
["4 Mental disorders",0.133571,0.14489299999999999,0.147672,0.13693900000000001,0.140907,0.16026399999999999,0.18947,0.193111,0.203953,0.21121799999999999,0.21371200000000001,0.20644699999999999,0.210145,0.21879100000000001,0.22357399999999999,0.23500699999999999,0.25308700000000001,0.26753900000000003,0.28459800000000002,0.29735800000000001,0.28240399999999999,0.274696,0.22445899999999999]
["5 Diseases of the nervous system and sense organs",0.366956,0.33805400000000002,0.30982799999999999,0.28362900000000002,0.27263900000000002,0.286715,0.28705900000000001,0.29835200000000001,0.30129499999999998,0.28454000000000002,0.28784300000000002,0.27667900000000001,0.29011100000000001,0.29056799999999999,0.28298699999999999,0.30236000000000002,0.30186299999999999,0.316081,0.33441599999999999,0.34538600000000003,0.38672899999999999,0.36211599999999999,0.268127]
["6 Diseases of the circulatory system",0.22200800000000001,0.24273,0.23807800000000001,0.23342099999999999,0.24367900000000001,0.25401600000000002,0.27818399999999999,0.28833199999999998,0.298983,0.30205599999999999,0.29640100000000003,0.33677600000000002,0.38506400000000002,0.38561299999999998,0.39137499999999997,0.39298,0.39243899999999998,0.401175,0.40675499999999998,0.41891099999999998,0.39801700000000001,0.37191299999999999,0.34766399999999997]
["7 Diseases of the respiratory system",0.796906,0.69800899999999999,0.63658800000000004,0.61895999999999995,0.59842700000000004,0.64293,0.62278599999999995,0.63576699999999997,0.60596399999999995,0.64726300000000003,0.59185100000000002,0.51703399999999999,0.59288700000000005,0.60888200000000003,0.58528400000000003,0.57671300000000003,0.63829800000000003,0.64857799999999999,0.56282699999999997,0.57347099999999995,0.51012500000000005,0.47613499999999997,0.30473699999999998]
["8 Diseases of the digestive system",0.433479,0.331376,0.28692400000000001,0.29419600000000001,0.293265,0.29280800000000001,0.31430999999999998,0.32328000000000001,0.31501400000000002,0.30668600000000001,0.31701499999999999,0.29971100000000001,0.35769299999999998,0.34709400000000001,0.32448700000000003,0.32605299999999998,0.27885100000000002,0.29569099999999998,0.26917400000000002,0.27909600000000001,0.24732799999999999,0.22103500000000001,0.15953600000000001]
["9 Diseases of the genitourinary system",0.15632699999999999,0.14779300000000001,0.12568399999999999,0.126664,0.13462099999999999,0.14333599999999999,0.143425,0.144256,0.14102700000000001,0.140318,0.13297999999999999,0.12892999999999999,0.131327,0.13369200000000001,0.13269500000000001,0.132102,0.131269,0.14558399999999999,0.148641,0.148227,0.12879099999999999,0.133518,0.12101199999999999]
["10 Complications of pregnancy, childbirth, and the puerperium",5.3117999999999999E-2,5.1402000000000003E-2,4.9655999999999999E-2,5.2322E-2,5.9855999999999999E-2,6.4588999999999994E-2,6.2475000000000003E-2,6.5583000000000002E-2,6.4342999999999997E-2,5.9288E-2,5.6707E-2,5.2221999999999998E-2,5.1039000000000001E-2,5.0488999999999999E-2,5.2248999999999997E-2,5.6105000000000002E-2,5.9202999999999999E-2,6.0803000000000003E-2,5.3252000000000001E-2,5.3700999999999999E-2,4.7247999999999998E-2,4.3184E-2,3.8935999999999998E-2]
["11 Diseases of the skin and subcutaneous tissue",0.117546,0.102951,9.9276000000000003E-2,9.2638999999999999E-2,9.9927000000000002E-2,0.11021400000000001,0.109875,0.10634200000000001,9.9779999999999994E-2,9.8683999999999994E-2,9.6544000000000005E-2,9.3912999999999996E-2,9.5326999999999995E-2,9.7175999999999998E-2,9.6482999999999999E-2,9.6906999999999993E-2,0.105268,0.11365500000000001,0.116326,0.113591,0.105491,9.6070000000000003E-2,8.5005999999999998E-2]
["12 Diseases of the musculoskeletal system and connective tissue",0.26456299999999999,0.27713900000000002,0.27509400000000001,0.271727,0.27080599999999999,0.302757,0.33568700000000001,0.34329700000000002,0.35052899999999998,0.34431600000000001,0.34327800000000003,0.37210599999999999,0.40967300000000001,0.42200399999999999,0.43397799999999997,0.43801800000000002,0.460476,0.50914700000000002,0.53506399999999998,0.54431600000000002,0.52571699999999999,0.493589,0.341395]
["13 Injury and poisoning",0.24623400000000001,0.26100200000000001,0.233069,0.21521399999999999,0.21557100000000001,0.227079,0.22998399999999999,0.23430500000000001,0.23383699999999999,0.230048,0.21479000000000001,0.21507000000000001,0.19825699999999999,0.20541899999999999,0.20141600000000001,0.19897999999999999,0.20666499999999999,0.24011199999999999,0.240924,0.24567,0.19262399999999999,0.173176,0.103852]
["14 Symptoms; signs; and ill-defined conditions",0.21856400000000001,0.18465400000000001,0.16591700000000001,0.171484,0.177706,0.194192,0.21023500000000001,0.21048600000000001,0.206622,0.19259200000000001,0.176313,0.15704499999999999,0.15699199999999999,0.170428,0.17322699999999999,0.183756,0.20031599999999999,0.21691199999999999,0.20849999999999999,0.21937699999999999,0.31342399999999998,0.29589500000000002,0.23804]
{"$rows_left_out":3}